Resultados 1 al 2 de 2

Tema: no se instalar ieee80211 en ubuntu

  1. #1 no se instalar ieee80211 en ubuntu 
    Avanzado
    Fecha de ingreso
    Jul 2007
    Ubicación
    en Linux ;D
    Mensajes
    334
    Descargas
    4
    Uploads
    0
    buenas

    se que tengo instalado algo del ieee80211, pero creo q no esta bien
    ayudadme a quitarlo y remplazarlo por el nuevo de http://ieee80211.sourceforge.net/

    Código:
    root@router-laptop:/home/router/Escritorio/3945/ieee80211-1.2.18# lsmod
    Module                  Size  Used by
    iwl3945                89844  0 
    iwlwifi_mac80211      219108  1 iwl3945
    cfg80211               15112  1 iwlwifi_mac80211
    af_packet              23812  4 
    nls_iso8859_1           4992  1 
    nls_cp437               6656  1 
    vfat                   14464  1 
    fat                    54556  1 vfat
    ipv6                  267780  10 
    binfmt_misc            12808  1 
    rfcomm                 41744  2 
    l2cap                  25728  13 rfcomm
    bluetooth              61156  4 rfcomm,l2cap
    vboxdrv                61360  0 
    sonypi                 23192  0 
    ppdev                  10372  0 
    acpi_cpufreq           10796  0 
    cpufreq_stats           7104  0 
    cpufreq_ondemand        9740  2 
    cpufreq_userspace       5284  0 
    freq_table              5536  3 acpi_cpufreq,cpufreq_stats,cpufreq_ondemand
    cpufreq_powersave       2688  0 
    cpufreq_conservative     8712  0 
    sbs                    15112  0 
    sbshc                   7680  1 sbs
    container               5632  0 
    dock                   11280  0 
    sony_acpi               6540  0 
    iptable_filter          3840  0 
    ip_tables              14820  1 iptable_filter
    x_tables               16132  1 ip_tables
    sbp2                   24072  0 
    parport_pc             36260  0 
    lp                     12324  0 
    parport                37832  3 ppdev,parport_pc,lp
    arc4                    2944  2 
    ecb                     4480  2 
    blkcipher               8324  1 ecb
    joydev                 13120  0 
    pcmcia                 40876  0 
    snd_hda_intel         344728  3 
    snd_pcm_oss            42144  0 
    snd_mixer_oss          17920  1 snd_pcm_oss
    nvidia               7825536  36 
    snd_pcm                78596  2 snd_hda_intel,snd_pcm_oss
    i2c_core               24832  1 nvidia
    snd_page_alloc         11400  2 snd_hda_intel,snd_pcm
    snd_hwdep              10500  1 snd_hda_intel
    sony_laptop            35292  0 
    snd_seq_dummy           4868  0 
    snd_seq_oss            35584  0 
    snd_seq_midi            9376  0 
    video                  19856  0 
    snd_rawmidi            25760  1 snd_seq_midi
    output                  4736  1 video
    tifm_7xx1               8576  0 
    snd_seq_midi_event      8320  2 snd_seq_oss,snd_seq_midi
    tifm_core              11012  1 tifm_7xx1
    yenta_socket           27276  1 
    rsrc_nonstatic         13696  1 yenta_socket
    pcmcia_core            40596  3 pcmcia,yenta_socket,rsrc_nonstatic
    snd_seq                54224  6 snd_seq_dummy,snd_seq_oss,snd_seq_midi,snd_seq_midi_event
    snd_timer              24836  2 snd_pcm,snd_seq
    snd_seq_device          9612  5 snd_seq_dummy,snd_seq_oss,snd_seq_midi,snd_rawmidi,snd_seq
    ac                      6916  0 
    button                  9232  0 
    battery                14212  0 
    psmouse                40336  0 
    intel_agp              25492  0 
    pcspkr                  4224  0 
    serio_raw               7940  0 
    snd                    56996  17 snd_hda_intel,snd_pcm_oss,snd_mixer_oss,snd_pcm,snd_hwdep,snd_seq_dummy,snd_seq_oss,snd_rawmidi,snd_seq,snd_timer,snd_seq_device
    iTCO_wdt               13092  0 
    iTCO_vendor_support     4868  1 iTCO_wdt
    agpgart                34760  2 nvidia,intel_agp
    shpchp                 34452  0 
    pci_hotplug            30880  1 shpchp
    evdev                  13056  10 
    soundcore               8800  1 snd
    ext3                  136712  1 
    jbd                    48404  1 ext3
    mbcache                 9600  1 ext3
    loop                   18948  2 
    usbhid                 31872  0 
    hid                    38784  1 usbhid
    sg                     36880  0 
    sd_mod                 30720  5 
    sr_mod                 17956  0 
    cdrom                  37408  1 sr_mod
    pata_acpi               8320  0 
    usb_storage            73664  1 
    libusual               19108  1 usb_storage
    ata_piix               19588  2 
    ata_generic             8324  0 
    ehci_hcd               37900  0 
    ohci1394               33584  0 
    uhci_hcd               27024  0 
    libata                159344  3 pata_acpi,ata_piix,ata_generic
    e100                   37388  0 
    mii                     6400  1 e100
    ieee1394               93752  2 sbp2,ohci1394
    scsi_mod              151436  6 sbp2,sg,sd_mod,sr_mod,usb_storage,libata
    usbcore               146028  6 usbhid,usb_storage,libusual,ehci_hcd,uhci_hcd
    thermal                16796  0 
    processor              36872  4 acpi_cpufreq,thermal
    fan                     5636  0 
    fbcon                  42912  0 
    tileblit                3456  1 fbcon
    font                    9472  1 fbcon
    bitblit                 6784  1 fbcon
    softcursor              3072  1 bitblit
    fuse                   50580  7 
    
    root@router-laptop:/home/router/Escritorio/3945/ieee80211-1.2.18# make
    Makefile:17: 
    Makefile:18: WARNING: $SHELL not set to bash.
    Makefile:19: If you experience build errors, try
    Makefile:20: 'make SHELL=/bin/bash'.
    Makefile:21: 
    Checking in /lib/modules/2.6.24-19-generic for ieee80211 components...
    make -C /lib/modules/2.6.24-19-generic/build M=/home/router/Escritorio/3945/ieee80211-1.2.18 modules
    make[1]: se ingresa al directorio `/usr/src/linux-headers-2.6.24-19-generic'
    /home/router/Escritorio/3945/ieee80211-1.2.18/Makefile:17: 
    /home/router/Escritorio/3945/ieee80211-1.2.18/Makefile:18: WARNING: $SHELL not set to bash.
    /home/router/Escritorio/3945/ieee80211-1.2.18/Makefile:19: If you experience build errors, try
    /home/router/Escritorio/3945/ieee80211-1.2.18/Makefile:20: 'make SHELL=/bin/bash'.
    /home/router/Escritorio/3945/ieee80211-1.2.18/Makefile:21: 
      CC [M]  /home/router/Escritorio/3945/ieee80211-1.2.18/ieee80211_module.o
    /home/router/Escritorio/3945/ieee80211-1.2.18/ieee80211_module.c: En la función ‘ieee80211_init’:
    /home/router/Escritorio/3945/ieee80211-1.2.18/ieee80211_module.c:268: error: ‘proc_net’ no se declaró aquí (primer uso en esta función)
    /home/router/Escritorio/3945/ieee80211-1.2.18/ieee80211_module.c:268: error: (Cada identificador no declarado solamente se reporta una vez
    /home/router/Escritorio/3945/ieee80211-1.2.18/ieee80211_module.c:268: error: para cada funcion en la que aparece.)
    /home/router/Escritorio/3945/ieee80211-1.2.18/ieee80211_module.c: En la función ‘ieee80211_exit’:
    /home/router/Escritorio/3945/ieee80211-1.2.18/ieee80211_module.c:297: error: ‘proc_net’ no se declaró aquí (primer uso en esta función)
    make[2]: *** [/home/router/Escritorio/3945/ieee80211-1.2.18/ieee80211_module.o] Error 1
    make[1]: *** [_module_/home/router/Escritorio/3945/ieee80211-1.2.18] Error 2
    make[1]: se sale del directorio `/usr/src/linux-headers-2.6.24-19-generic'
    make: *** [modules] Error 2
    
    root@router-laptop:/home/router/Escritorio/3945/ieee80211-1.2.18#
    que puedo hacer??? porque me da error 2??

    saludos
    Citar  
     

  2. #2  
    Moderador Global
    Fecha de ingreso
    Aug 2005
    Mensajes
    6.279
    Descargas
    7
    Uploads
    0
    Eso es para entornos de testeo e inestables. Ya tienes una infraestructura funcional en tu sistema.

    Salu2


    Keep on Rollin'

    . . . . . . . . . . . . . . . . . . . .
    [[ NORMAS DEL FORO ]]
    . . . . . . . . . . . . . . . . . . . .
    __________
    Citar  
     

Temas similares

  1. No puedo instalar ubuntu
    Por mindundio en el foro GENERAL
    Respuestas: 0
    Último mensaje: 12-09-2012, 17:02
  2. imposible instalar ubuntu
    Por bubuketo en el foro LINUX - MAC - OTROS
    Respuestas: 1
    Último mensaje: 03-03-2009, 02:44
  3. instalar wireless ubuntu
    Por matapete en el foro LINUX - MAC - OTROS
    Respuestas: 5
    Último mensaje: 12-08-2008, 16:23
  4. Error al instalar ubuntu
    Por Daniel666999 en el foro LINUX - MAC - OTROS
    Respuestas: 9
    Último mensaje: 02-08-2008, 10:41
  5. Incapaz de instalar ubuntu
    Por Shonio en el foro LINUX - MAC - OTROS
    Respuestas: 7
    Último mensaje: 05-04-2007, 05:08

Marcadores

Marcadores

Permisos de publicación

  • No puedes crear nuevos temas
  • No puedes responder temas
  • No puedes subir archivos adjuntos
  • No puedes editar tus mensajes
  •